Theater Migrants Ontology
type: Ontology
creator: DanielHernandez

DanielHernandez
type: Person
family name: Hernandez
given name: Daniel

PropertyValue
property ID: ORCID
value: 0000-0002-7896-0875

Religion
type: Class
comment: A religion or religious tradition.

Religion Affiliation
type: Class
comment: A record of a person's affiliation with a religion, optionally bounded by a time interval.

person
type: ObjectProperty
comment: The person associated with this religion affiliation.
domain: Religion Affiliation
range: Person

religion
type: ObjectProperty
comment: The religion the person is affiliated with.
domain: Religion Affiliation
range: Religion

denomination
type: DatatypeProperty
comment: The specific denomination within the religion.
domain: Religion Affiliation
range: string

fuzzy start date
type: DatatypeProperty
comment: A human-readable description of the start date when it cannot be expressed precisely.
domain: Religion Affiliation
range: string

start date
type: DatatypeProperty
domain: Religion Affiliation
range: date

maximum start date
type: DatatypeProperty
comment: The latest possible start date of the affiliation.
domain: Religion Affiliation
range: string

minimum end date
type: DatatypeProperty
comment: The earliest possible end date of the affiliation.
domain: Religion Affiliation
range: date

maximum end date
type: DatatypeProperty
comment: The latest possible end date of the affiliation.
domain: Religion Affiliation
range: date